{"text_format":"1","workbook":"xlsx","n_sheets":6,"sheets":["はじめに出場選手の入力","男子","女子","男女リレー","申込書","混成の申込"],"not_rendered":{"charts":0,"images":0,"macros":1,"external_links":0,"defined_names":8,"comments":0,"pivot_tables":0},"unopened":[],"bounds":{"document_bytes":16777216,"sheet_cells":100000,"rows_first":2000,"rows_last":500,"rows_between":2000,"halvings":0,"cell_chars":16384,"cell_head_chars":4096},"cells_cut":0,"cells_raw":0,"read":"whole","date_system":"1900"}

{"sheet":"はじめに出場選手の入力","index":0,"n_rows":44,"n_cols":26,"rows_kept":44,"cut":false,"hidden":false,"merged":[[6,8,6,9],[6,10,6,12],[8,11,8,14],[7,10,7,11],[11,10,11,11]]}
["第",7,"回七尾城山記録会",null,null,null,null,"平成",30,"年度",null,null,null,null,null,null,null,null,null,null,null,null,null,{"$f":"+C1","v":"回七尾城山記録会"}]
[null,"一般　・　大学　・　小学生用申込用"]
[null,null,"所属名"]
[null,null,"県名","市町名","校名等","校種等"]
[null,null,null,null,null,null,null,null,null,null,"のセルに入力してください。"]
[null,null,"記入例",null,null,null,null,null,null,"※記入例は削除してから入力してください。"]
[null,null,"石川県","七尾市立","●●●","小学校",null,null,"団体名（学校名）",null,{"$f":"+D5&E5&F5","v":""}]
[null,null,"富山県",null,"■■■","大学",null,null,"電話番号"]
[null,null,"石川県",null,"▲▲AC","一般",null,null,"団体住所",null,"〒"]
[null,null,"富山県",null,"会社名等","一般",null,null,"所属長"]
{"$rows_left_out":35}
{"sheet":"男子","index":1,"n_rows":67,"n_cols":23,"rows_kept":67,"cut":false,"hidden":false,"merged":[[0,2,1,2],[37,17,38,19],[41,17,42,19],[2,6,2,18],[12,22,14,22],[18,22,22,22],[1,22,3,22]]}
[null,null,"男子",null,null,null,"※自己記録または　「なし」　を入力しないとエントリーできません。"]
[null,null,null,null,null,null,null,null,null,null,null,null,null,null,null,null,null,null,null,null,null,null,"関数の入っているセルは\n入力しないでください。"]
[null,null,"トラック申し込み",null,null,null,"記入例を削除して、出場種目の欄に自己記録を入力。記録がない場合は　「なし」　を入力。"]
["no.","県名","ﾅﾝﾊﾞｰ","選　手　名","所属","学年","100m","200m","400m","800m","1500m","3000m","5000m","110mH","400mH","3000W","5000W","80mH","110JH",null,"エントリー数"]
[1,{"$f":"IF(はじめに出場選手の入力!B15=\"\",\"\",はじめに出場選手の入力!B15)","v":""},{"$f":"IF(はじめに出場選手の入力!C15=\"\",\"\",はじめに出場選手の入力!C15)","v":""},{"$f":"IF(はじめに出場選手の入力!D15=\"\",\"\",はじめに出場選手の入力!D15)","v":""},{"$f":"IF(はじめに出場選手の入力!E15=\"\",\"\",はじめに出場選手の入力!E15)","v":""},{"$f":"IF(はじめに出場選手の入力!F15=\"\",\"\",はじめに出場選手の入力!F15)","v":""},null,null,null,null,null,null,null,null,null,null,null,null,null,null,{"$f":"COUNTA(G5:S5)","v":0}]
[2,{"$f":"IF(はじめに出場選手の入力!B16=\"\",\"\",はじめに出場選手の入力!B16)","v":""},{"$f":"IF(はじめに出場選手の入力!C16=\"\",\"\",はじめに出場選手の入力!C16)","v":""},{"$f":"IF(はじめに出場選手の入力!D16=\"\",\"\",はじめに出場選手の入力!D16)","v":""},{"$f":"IF(はじめに出場選手の入力!E16=\"\",\"\",はじめに出場選手の入力!E16)","v":""},{"$f":"IF(はじめに出場選手の入力!F16=\"\",\"\",はじめに出場選手の入力!F16)","v":""},null,null,null,null,null,null,null,null,null,null,null,null,null,null,{"$f":"COUNTA(G6:S6)","v":0}]
[3,{"$f":"IF(はじめに出場選手の入力!B17=\"\",\"\",はじめに出場選手の入力!B17)","v":""},{"$f":"IF(はじめに出場選手の入力!C17=\"\",\"\",はじめに出場選手の入力!C17)","v":""},{"$f":"IF(はじめに出場選手の入力!D17=\"\",\"\",はじめに出場選手の入力!D17)","v":""},{"$f":"IF(はじめに出場選手の入力!E17=\"\",\"\",はじめに出場選手の入力!E17)","v":""},{"$f":"IF(はじめに出場選手の入力!F17=\"\",\"\",はじめに出場選手の入力!F17)","v":""},null,null,null,null,null,null,null,null,null,null,null,null,null,null,0]
[4,{"$f":"IF(はじめに出場選手の入力!B18=\"\",\"\",はじめに出場選手の入力!B18)","v":""},{"$f":"IF(はじめに出場選手の入力!C18=\"\",\"\",はじめに出場選手の入力!C18)","v":""},{"$f":"IF(はじめに出場選手の入力!D18=\"\",\"\",はじめに出場選手の入力!D18)","v":""},{"$f":"IF(はじめに出場選手の入力!E18=\"\",\"\",はじめに出場選手の入力!E18)","v":""},{"$f":"IF(はじめに出場選手の入力!F18=\"\",\"\",はじめに出場選手の入力!F18)","v":""},null,null,null,null,null,null,null,null,null,null,null,null,null,null,0]
[5,{"$f":"IF(はじめに出場選手の入力!B19=\"\",\"\",はじめに出場選手の入力!B19)","v":""},{"$f":"IF(はじめに出場選手の入力!C19=\"\",\"\",はじめに出場選手の入力!C19)","v":""},{"$f":"IF(はじめに出場選手の入力!D19=\"\",\"\",はじめに出場選手の入力!D19)","v":""},{"$f":"IF(はじめに出場選手の入力!E19=\"\",\"\",はじめに出場選手の入力!E19)","v":""},{"$f":"IF(はじめに出場選手の入力!F19=\"\",\"\",はじめに出場選手の入力!F19)","v":""},null,null,null,null,null,null,null,null,null,null,null,null,null,null,0,null,"自己記録の入力方法"]
[6,{"$f":"IF(はじめに出場選手の入力!B20=\"\",\"\",はじめに出場選手の入力!B20)","v":""},{"$f":"IF(はじめに出場選手の入力!C20=\"\",\"\",はじめに出場選手の入力!C20)","v":""},{"$f":"IF(はじめに出場選手の入力!D20=\"\",\"\",はじめに出場選手の入力!D20)","v":""},{"$f":"IF(はじめに出場選手の入力!E20=\"\",\"\",はじめに出場選手の入力!E20)","v":""},{"$f":"IF(はじめに出場選手の入力!F20=\"\",\"\",はじめに出場選手の入力!F20)","v":""},null,null,null,null,null,null,null,null,null,null,null,null,null,null,0,null,"記入例"]
{"$rows_left_out":58}
{"sheet":"女子","index":2,"n_rows":67,"n_cols":24,"rows_kept":67,"cut":false,"hidden":false,"merged":[[0,2,1,2],[37,17,38,19],[41,17,42,19],[12,23,14,23],[18,23,22,23],[1,23,3,23],[2,6,2,18]]}
[null,null,"女子",null,null,null,"※自己記録または　「なし」　を入力しないとエントリーできません。"]
[null,null,null,null,null,null,null,null,null,null,null,null,null,null,null,null,null,null,null,null,null,null,null,"関数の入っているセルは\n入力しないでください。"]
[null,null,null,null,null,null,"記入例を削除して、出場種目の欄に自己記録を入力。記録がない場合は　「なし」　を入力。"]
["no.","県名","ﾅﾝﾊﾞｰ","選　手　名","所属","学年","100m","200m","400m","800m","1500m","3000m",null,"100mH","400mH","3000W","5000W","80mH","100mYH",null,"エントリー数"]
[1,{"$f":"IF(はじめに出場選手の入力!I15=\"\",\"\",はじめに出場選手の入力!I15)","v":""},{"$f":"IF(はじめに出場選手の入力!J15=\"\",\"\",はじめに出場選手の入力!J15)","v":""},{"$f":"IF(はじめに出場選手の入力!K15=\"\",\"\",はじめに出場選手の入力!K15)","v":""},{"$f":"IF(はじめに出場選手の入力!L15=\"\",\"\",はじめに出場選手の入力!L15)","v":""},{"$f":"IF(はじめに出場選手の入力!M15=\"\",\"\",はじめに出場選手の入力!M15)","v":""},null,null,null,null,null,null,null,null,null,null,null,null,null,null,{"$f":"COUNTA(G5:S5)","v":0}]
[2,{"$f":"IF(はじめに出場選手の入力!I16=\"\",\"\",はじめに出場選手の入力!I16)","v":""},{"$f":"IF(はじめに出場選手の入力!J16=\"\",\"\",はじめに出場選手の入力!J16)","v":""},{"$f":"IF(はじめに出場選手の入力!K16=\"\",\"\",はじめに出場選手の入力!K16)","v":""},{"$f":"IF(はじめに出場選手の入力!L16=\"\",\"\",はじめに出場選手の入力!L16)","v":""},{"$f":"IF(はじめに出場選手の入力!M16=\"\",\"\",はじめに出場選手の入力!M16)","v":""},null,null,null,null,null,null,null,null,null,null,null,null,null,null,{"$f":"COUNTA(G6:S6)","v":0}]
[3,{"$f":"IF(はじめに出場選手の入力!I17=\"\",\"\",はじめに出場選手の入力!I17)","v":""},{"$f":"IF(はじめに出場選手の入力!J17=\"\",\"\",はじめに出場選手の入力!J17)","v":""},{"$f":"IF(はじめに出場選手の入力!K17=\"\",\"\",はじめに出場選手の入力!K17)","v":""},{"$f":"IF(はじめに出場選手の入力!L17=\"\",\"\",はじめに出場選手の入力!L17)","v":""},{"$f":"IF(はじめに出場選手の入力!M17=\"\",\"\",はじめに出場選手の入力!M17)","v":""},null,null,null,null,null,null,null,null,null,null,null,null,null,null,0]
[4,{"$f":"IF(はじめに出場選手の入力!I18=\"\",\"\",はじめに出場選手の入力!I18)","v":""},{"$f":"IF(はじめに出場選手の入力!J18=\"\",\"\",はじめに出場選手の入力!J18)","v":""},{"$f":"IF(はじめに出場選手の入力!K18=\"\",\"\",はじめに出場選手の入力!K18)","v":""},{"$f":"IF(はじめに出場選手の入力!L18=\"\",\"\",はじめに出場選手の入力!L18)","v":""},{"$f":"IF(はじめに出場選手の入力!M18=\"\",\"\",はじめに出場選手の入力!M18)","v":""},null,null,null,null,null,null,null,null,null,null,null,null,null,null,0]
[5,{"$f":"IF(はじめに出場選手の入力!I19=\"\",\"\",はじめに出場選手の入力!I19)","v":""},{"$f":"IF(はじめに出場選手の入力!J19=\"\",\"\",はじめに出場選手の入力!J19)","v":""},{"$f":"IF(はじめに出場選手の入力!K19=\"\",\"\",はじめに出場選手の入力!K19)","v":""},{"$f":"IF(はじめに出場選手の入力!L19=\"\",\"\",はじめに出場選手の入力!L19)","v":""},{"$f":"IF(はじめに出場選手の入力!M19=\"\",\"\",はじめに出場選手の入力!M19)","v":""},null,null,null,null,null,null,null,null,null,null,null,null,null,null,0,null,null,"自己記録の入力方法"]
[6,{"$f":"IF(はじめに出場選手の入力!I20=\"\",\"\",はじめに出場選手の入力!I20)","v":""},{"$f":"IF(はじめに出場選手の入力!J20=\"\",\"\",はじめに出場選手の入力!J20)","v":""},{"$f":"IF(はじめに出場選手の入力!K20=\"\",\"\",はじめに出場選手の入力!K20)","v":""},{"$f":"IF(はじめに出場選手の入力!L20=\"\",\"\",はじめに出場選手の入力!L20)","v":""},{"$f":"IF(はじめに出場選手の入力!M20=\"\",\"\",はじめに出場選手の入力!M20)","v":""},null,null,null,null,null,null,null,null,null,null,null,null,null,null,0,null,null,"記入例"]
{"$rows_left_out":58}
{"sheet":"男女リレー","index":3,"n_rows":69,"n_cols":28,"rows_kept":69,"cut":false,"hidden":false,"merged":[[22,25,23,27],[10,25,11,27],[2,23,4,23],[14,23,16,23],[20,23,25,23],[6,25,7,25],[6,26,7,26],[6,27,7,27],[18,25,19,25],[18,26,19,26],[18,27,19,27]]}
["記入見本","県名","チーム名","記録","№","氏名","学年","№","氏名","学年","№","氏名","学年","№","氏名","学年","№","氏名","学年","№","氏名","学年"]
["(1)","石川県","七尾陸上高校","49.26",781,"風向　育三",1,781,"吹風　逆行",1,94,"大河　流冷",2,96,"翼　開",2,97,"古倉　一造",1,100,"川端　康成",1]
[null,null,null,null,null,null,null,null,null,null,null,null,null,null,null,null,null,null,null,null,null,null,null,"関数の入っているセルは\n入力しないでください。"]
[]
["男　子 ４×１００ｍＲ",null,null,null,null,null,null,null,null,null,null,null,null,null,null,null,null,null,null,null,null,null,null,null,null,"男子リレー種目エントリー数"]
[null,"県名","チーム名","記録","№","氏名","学年","№","氏名","学年","№","氏名","学年","№","氏名","学年","№","氏名","学年","№","氏名","学年",null,null,null,"4×100ｍＲ","4×400ｍＲ","ﾒﾄﾞﾚｰＲ"]
["(1)",{"$f":"はじめに出場選手の入力!$C$5","v":0},{"$f":"+はじめに出場選手の入力!$E$15&\"Ａ\"","v":"Ａ"},null,null,{"$f":"IF(E7=\"\",\"\",VLOOKUP(E7,はじめに出場選手の入力!$C$15:$F$44,2))","v":""},{"$f":"IF(E7=\"\",\"\",VLOOKUP(E7,はじめに出場選手の入力!$C$15:$F$44,4))","v":""},null,{"$f":"IF(H7=\"\",\"\",VLOOKUP(H7,はじめに出場選手の入力!$C$15:$F$44,2))","v":""},{"$f":"IF(H7=\"\",\"\",VLOOKUP(H7,はじめに出場選手の入力!$C$15:$F$44,4))","v":""},null,{"$f":"IF(K7=\"\",\"\",VLOOKUP(K7,はじめに出場選手の入力!$C$15:$F$44,2))","v":""},{"$f":"IF(K7=\"\",\"\",VLOOKUP(K7,はじめに出場選手の入力!$C$15:$F$44,4))","v":""},null,{"$f":"IF(N7=\"\",\"\",VLOOKUP(N7,はじめに出場選手の入力!$C$15:$F$44,2))","v":""},{"$f":"IF(N7=\"\",\"\",VLOOKUP(N7,はじめに出場選手の入力!$C$15:$F$44,4))","v":""},null,{"$f":"IF(Q7=\"\",\"\",VLOOKUP(Q7,はじめに出場選手の入力!$C$15:$F$44,2))","v":""},{"$f":"IF(Q7=\"\",\"\",VLOOKUP(Q7,はじめに出場選手の入力!$C$15:$F$44,4))","v":""},null,{"$f":"IF(T7=\"\",\"\",VLOOKUP(T7,はじめに出場選手の入力!$C$15:$F$44,2))","v":""},{"$f":"IF(T7=\"\",\"\",VLOOKUP(T7,はじめに出場選手の入力!$C$15:$F$44,4))","v":""},null,null,null,{"$f":"+COUNTA(D7:D14)","v":0},{"$f":"+COUNTA(D18:D25)","v":0},{"$f":"+COUNTA(D29:D36)","v":0}]
["(2)",{"$f":"はじめに出場選手の入力!$C$5","v":0},{"$f":"+はじめに出場選手の入力!$E$15&\"Ｂ\"","v":"Ｂ"},null,null,{"$f":"IF(E8=\"\",\"\",VLOOKUP(E8,はじめに出場選手の入力!$C$15:$F$44,2))","v":""},{"$f":"IF(E8=\"\",\"\",VLOOKUP(E8,はじめに出場選手の入力!$C$15:$F$44,4))","v":""},null,{"$f":"IF(H8=\"\",\"\",VLOOKUP(H8,はじめに出場選手の入力!$C$15:$F$44,2))","v":""},{"$f":"IF(H8=\"\",\"\",VLOOKUP(H8,はじめに出場選手の入力!$C$15:$F$44,4))","v":""},null,{"$f":"IF(K8=\"\",\"\",VLOOKUP(K8,はじめに出場選手の入力!$C$15:$F$44,2))","v":""},{"$f":"IF(K8=\"\",\"\",VLOOKUP(K8,はじめに出場選手の入力!$C$15:$F$44,4))","v":""},null,{"$f":"IF(N8=\"\",\"\",VLOOKUP(N8,はじめに出場選手の入力!$C$15:$F$44,2))","v":""},{"$f":"IF(N8=\"\",\"\",VLOOKUP(N8,はじめに出場選手の入力!$C$15:$F$44,4))","v":""},null,{"$f":"IF(Q8=\"\",\"\",VLOOKUP(Q8,はじめに出場選手の入力!$C$15:$F$44,2))","v":""},{"$f":"IF(Q8=\"\",\"\",VLOOKUP(Q8,はじめに出場選手の入力!$C$15:$F$44,4))","v":""},null,{"$f":"IF(T8=\"\",\"\",VLOOKUP(T8,はじめに出場選手の入力!$C$15:$F$44,2))","v":""},{"$f":"IF(T8=\"\",\"\",VLOOKUP(T8,はじめに出場選手の入力!$C$15:$F$44,4))","v":""}]
["(3)",{"$f":"はじめに出場選手の入力!$C$5","v":0},{"$f":"+はじめに出場選手の入力!$E$15&\"Ｃ\"","v":"Ｃ"},null,null,{"$f":"IF(E9=\"\",\"\",VLOOKUP(E9,はじめに出場選手の入力!$C$15:$F$44,2))","v":""},{"$f":"IF(E9=\"\",\"\",VLOOKUP(E9,はじめに出場選手の入力!$C$15:$F$44,4))","v":""},null,{"$f":"IF(H9=\"\",\"\",VLOOKUP(H9,はじめに出場選手の入力!$C$15:$F$44,2))","v":""},{"$f":"IF(H9=\"\",\"\",VLOOKUP(H9,はじめに出場選手の入力!$C$15:$F$44,4))","v":""},null,{"$f":"IF(K9=\"\",\"\",VLOOKUP(K9,はじめに出場選手の入力!$C$15:$F$44,2))","v":""},{"$f":"IF(K9=\"\",\"\",VLOOKUP(K9,はじめに出場選手の入力!$C$15:$F$44,4))","v":""},null,{"$f":"IF(N9=\"\",\"\",VLOOKUP(N9,はじめに出場選手の入力!$C$15:$F$44,2))","v":""},{"$f":"IF(N9=\"\",\"\",VLOOKUP(N9,はじめに出場選手の入力!$C$15:$F$44,4))","v":""},null,{"$f":"IF(Q9=\"\",\"\",VLOOKUP(Q9,はじめに出場選手の入力!$C$15:$F$44,2))","v":""},{"$f":"IF(Q9=\"\",\"\",VLOOKUP(Q9,はじめに出場選手の入力!$C$15:$F$44,4))","v":""},null,{"$f":"IF(T9=\"\",\"\",VLOOKUP(T9,はじめに出場選手の入力!$C$15:$F$44,2))","v":""},{"$f":"IF(T9=\"\",\"\",VLOOKUP(T9,はじめに出場選手の入力!$C$15:$F$44,4))","v":""}]
["(4)",{"$f":"はじめに出場選手の入力!$C$5","v":0},{"$f":"+はじめに出場選手の入力!$E$15&\"Ｄ\"","v":"Ｄ"},null,null,{"$f":"IF(E10=\"\",\"\",VLOOKUP(E10,はじめに出場選手の入力!$C$15:$F$44,2))","v":""},{"$f":"IF(E10=\"\",\"\",VLOOKUP(E10,はじめに出場選手の入力!$C$15:$F$44,4))","v":""},null,{"$f":"IF(H10=\"\",\"\",VLOOKUP(H10,はじめに出場選手の入力!$C$15:$F$44,2))","v":""},{"$f":"IF(H10=\"\",\"\",VLOOKUP(H10,はじめに出場選手の入力!$C$15:$F$44,4))","v":""},null,{"$f":"IF(K10=\"\",\"\",VLOOKUP(K10,はじめに出場選手の入力!$C$15:$F$44,2))","v":""},{"$f":"IF(K10=\"\",\"\",VLOOKUP(K10,はじめに出場選手の入力!$C$15:$F$44,4))","v":""},null,{"$f":"IF(N10=\"\",\"\",VLOOKUP(N10,はじめに出場選手の入力!$C$15:$F$44,2))","v":""},{"$f":"IF(N10=\"\",\"\",VLOOKUP(N10,はじめに出場選手の入力!$C$15:$F$44,4))","v":""},null,{"$f":"IF(Q10=\"\",\"\",VLOOKUP(Q10,はじめに出場選手の入力!$C$15:$F$44,2))","v":""},{"$f":"IF(Q10=\"\",\"\",VLOOKUP(Q10,はじめに出場選手の入力!$C$15:$F$44,4))","v":""},null,{"$f":"IF(T10=\"\",\"\",VLOOKUP(T10,はじめに出場選手の入力!$C$15:$F$44,2))","v":""},{"$f":"IF(T10=\"\",\"\",VLOOKUP(T10,はじめに出場選手の入力!$C$15:$F$44,4))","v":""},null,"自己記録の入力方法",null,"男子","総エントリー数"]
{"$rows_left_out":60}
{"sheet":"申込書","index":4,"n_rows":122,"n_cols":15,"rows_kept":122,"cut":false,"hidden":false,"merged":[[107,9,107,11],[27,3,27,4],[5,2,5,3],[104,7,104,8],[74,7,74,8],[102,7,102,8],[103,7,103,8],[100,7,100,8],[101,7,101,8],[98,7,98,8],[93,7,93,8],[90,7,90,8],[91,7,91,8],[90,2,90,6],[91,2,91,6],[92,2,92,6],[93,2,93,6],[99,7,99,8],[96,7,96,8],[97,7,97,8],[94,7,94,8],[95,7,95,8],[94,2,94,6],[95,2,95,6],[88,7,88,8],[89,7,89,8],[86,7,86,8],[87,7,87,8],[86,2,86,6],[87,2,87,6],[88,2,88,6],[89,2,89,6],[92,7,92,8],[81,7,81,8],[78,7,78,8],[79,7,79,8],[78,2,78,6],[79,2,79,6],[80,2,80,6],[81,2,81,6],[84,7,84,8],[85,7,85,8],[82,7,82,8],[83,7,83,8],[82,2,82,6],[83,2,83,6],[84,2,84,6],[85,2,85,6],[77,7,77,8],[70,7,70,8],[75,7,75,8],[70,2,70,6],[74,2,74,6],[75,2,75,6],[76,2,76,6],[77,2,77,6],[80,7,80,8],[68,7,68,8],[69,7,69,8],[66,7,66,8],[67,7,67,8],[66,2,66,6],[67,2,67,6],[68,2,68,6],[69,2,69,6],[76,7,76,8],[61,7,61,8],[58,7,58,8],[59,7,59,8],[61,2,61,6],[64,7,64,8],[65,7,65,8],[62,7,62,8],[63,7,63,8],[62,2,62,6],[63,2,63,6],[64,2,64,6],[65,2,65,6],[50,7,50,8],[51,7,51,8],[56,7,56,8],[57,7,57,8],[54,7,54,8],[55,7,55,8],[60,7,60,8],[58,2,58,6],[59,2,59,6],[60,2,60,6],[39,10,39,12],[3,14,5,15],[5,9,5,10],[5,4,5,5],[119,8,119,9],[3,4,3,7],[114,7,114,8],[110,5,110,8],[28,8,28,10],[31,3,31,5],[38,10,38,12],[41,7,41,8],[40,7,40,8],[42,7,42,8],[43,7,43,8],[44,7,44,8],[45,7,45,8],[48,7,48,8],[49,7,49,8],[46,7,46,8],[47,7,47,8],[52,7,52,8],[112,2,112,6],[53,7,53,8],[40,2,40,6],[41,2,41,6],[42,2,42,6],[43,2,43,6],[44,2,44,6],[45,2,45,6],[46,2,46,6],[47,2,47,6],[48,2,48,6],[100,2,100,6],[101,2,101,6],[102,2,102,6],[103,2,103,6],[104,2,104,6],[49,2,49,6],[50,2,50,6],[51,2,51,6],[52,2,52,6],[53,2,53,6],[54,2,54,6],[55,2,55,6],[56,2,56,6],[57,2,57,6],[97,2,97,6],[98,2,98,6],[99,2,99,6],[96,2,96,6]]}
[null,null,null,null,null,null,null,null,null,null,null,null,null,"申し込みの際はこのシートをプリントアウトし押印して、当日受付に提出する。"]
[null,null,{"$f":"+はじめに出場選手の入力!A1&はじめに出場選手の入力!B1&はじめに出場選手の入力!X1&\"申込書（小学生・大学生・一般用）\"","v":"第7回七尾城山記録会申込書（小学生・大学生・一般用）"},null,null,null,null,null,null,null,null,null,null,"大会名は能登ジュニアの場合は書き換えてください。"]
[null,null,null,null,null,null,null,null,"申込日",{"$f":"+はじめに出場選手の入力!H1&はじめに出場選手の入力!I1&\"年\"","v":"平成30年"},"2018-11-10",null,null,"日付は例：「５／１１」で入力"]
[null,null,"所属名・学校名",null,{"$f":"はじめに出場選手の入力!D5&はじめに出場選手の入力!E5&はじめに出場選手の入力!F5","v":""},null,null,null,null,null,null,null,null,null,"関数の入っているセルは\n入力しないでください。"]
[]
[null,null,"記載責任者",null,{"$f":"+はじめに出場選手の入力!K11","v":0},null,null,"記載責任者電話番号",null,{"$f":"+はじめに出場選手の入力!K12","v":0}]
[]
[]
[null,null,"参加料","男子"]
[null,null,null,"個人種目",{"$f":"IF(はじめに出場選手の入力!$F$5=\"小学校\",200,300)","v":300},"円×",{"$f":"男子!R38+男子!R42","v":0},"種目＝",{"$f":"E10*G10","v":0},"円",null,null,null,"ジュニアは５００円（中学～高２）"]
{"$rows_left_out":113}
{"sheet":"混成の申込","index":5,"n_rows":69,"n_cols":21,"rows_kept":69,"cut":false,"hidden":false,"merged":[[35,16,35,18],[0,2,1,2],[35,2,36,2],[37,6,37,9],[35,13,35,15]]}
[null,null,"男子","※自己記録(得点)または　「なし」　を入力しないとエントリーできません。"]
[]
[null,null,null,null,null,null,null,null,null,null,null,null,null,"試技順作成の資料としますので、できるだけベスト記録等を記入してください。"]
["no.","県名","ﾅﾝﾊﾞｰ","選　手　名","所属","学年","四種","五種","八種","十種",null,"混成のエントリー数",null,"100m","走幅跳","砲丸投","400m","110mH","やり投","走高跳","1500m"]
[1,null,{"$f":"IF(はじめに出場選手の入力!C15=\"\",\"\",はじめに出場選手の入力!C15)","v":""},{"$f":"IF(はじめに出場選手の入力!D15=\"\",\"\",はじめに出場選手の入力!D15)","v":""},{"$f":"IF(はじめに出場選手の入力!E15=\"\",\"\",はじめに出場選手の入力!E15)","v":""},{"$f":"IF(はじめに出場選手の入力!F15=\"\",\"\",はじめに出場選手の入力!F15)","v":""},null,null,null,null,null,{"$f":"COUNTA(G5:J5)","v":0}]
[2,null,{"$f":"IF(はじめに出場選手の入力!C16=\"\",\"\",はじめに出場選手の入力!C16)","v":""},{"$f":"IF(はじめに出場選手の入力!D16=\"\",\"\",はじめに出場選手の入力!D16)","v":""},{"$f":"IF(はじめに出場選手の入力!E16=\"\",\"\",はじめに出場選手の入力!E16)","v":""},{"$f":"IF(はじめに出場選手の入力!F16=\"\",\"\",はじめに出場選手の入力!F16)","v":""},null,null,null,null,null,{"$f":"COUNTA(G6:J6)","v":0}]
[3,null,{"$f":"IF(はじめに出場選手の入力!C17=\"\",\"\",はじめに出場選手の入力!C17)","v":""},{"$f":"IF(はじめに出場選手の入力!D17=\"\",\"\",はじめに出場選手の入力!D17)","v":""},{"$f":"IF(はじめに出場選手の入力!E17=\"\",\"\",はじめに出場選手の入力!E17)","v":""},{"$f":"IF(はじめに出場選手の入力!F17=\"\",\"\",はじめに出場選手の入力!F17)","v":""},null,null,null,null,null,0]
[4,null,{"$f":"IF(はじめに出場選手の入力!C18=\"\",\"\",はじめに出場選手の入力!C18)","v":""},{"$f":"IF(はじめに出場選手の入力!D18=\"\",\"\",はじめに出場選手の入力!D18)","v":""},{"$f":"IF(はじめに出場選手の入力!E18=\"\",\"\",はじめに出場選手の入力!E18)","v":""},{"$f":"IF(はじめに出場選手の入力!F18=\"\",\"\",はじめに出場選手の入力!F18)","v":""},null,null,null,null,null,0]
[5,null,{"$f":"IF(はじめに出場選手の入力!C19=\"\",\"\",はじめに出場選手の入力!C19)","v":""},{"$f":"IF(はじめに出場選手の入力!D19=\"\",\"\",はじめに出場選手の入力!D19)","v":""},{"$f":"IF(はじめに出場選手の入力!E19=\"\",\"\",はじめに出場選手の入力!E19)","v":""},{"$f":"IF(はじめに出場選手の入力!F19=\"\",\"\",はじめに出場選手の入力!F19)","v":""},null,null,null,null,null,0]
[6,null,{"$f":"IF(はじめに出場選手の入力!C20=\"\",\"\",はじめに出場選手の入力!C20)","v":""},{"$f":"IF(はじめに出場選手の入力!D20=\"\",\"\",はじめに出場選手の入力!D20)","v":""},{"$f":"IF(はじめに出場選手の入力!E20=\"\",\"\",はじめに出場選手の入力!E20)","v":""},{"$f":"IF(はじめに出場選手の入力!F20=\"\",\"\",はじめに出場選手の入力!F20)","v":""},null,null,null,null,null,0]
{"$rows_left_out":59}